{"text_format":"1","workbook":"xlsx","n_sheets":2,"sheets":["Formato","Catálogo"],"not_rendered":{"charts":0,"images":1,"macros":1,"external_links":0,"defined_names":2,"comments":0,"pivot_tables":0},"unopened":[],"bounds":{"document_bytes":16777216,"sheet_cells":100000,"rows_first":2000,"rows_last":500,"rows_between":2000,"halvings":0,"cell_chars":16384,"cell_head_chars":4096},"cells_cut":0,"cells_raw":0,"read":"whole","date_system":"1900"}

{"sheet":"Formato","index":0,"n_rows":115,"n_cols":4,"rows_kept":115,"cut":false,"hidden":false,"merged":[[5,0,5,2],[4,0,4,2],[6,0,6,1],[2,5,4,5],[0,1,0,3],[2,1,2,3]]}
[null,"Lineamiento tercero, fracción IV. Reporte de las temáticas desglosadas por subtema"]
[null,"Normatividad aplicable a:"]
[null,"Partido de la Revolución Democrática"]
[null,null,null,{"$f":"IF(B3=\"Seleccione el nombre del sujeto obligado\",\"\",VLOOKUP(B3,Catálogo!A2:B858,2,0))","v":"22340"}]
["Trimestre que informa",null,null,"3° 2022"]
["1.- Durante el periodo que reporta se recibieron Solicitudes de Información?",null,null,"Si"]
["Temáticas de las solicitudes  de información pública",null,"Número de solicitudes información del periodo informado","% del total ingresado"]
["1. Actividades de la institución ",null,{"$f":"SUM(C9:C12)","v":1},{"$f":"IF(C8=0,\"\",(C8/$C$115)*100)","v":3.125}]
[null,"a. Programa de trabajo",1,{"$f":"IF(C9=\"\",\"\",(C9/$C$115)*100)","v":3.125}]
[null,"b. Resultados de actividades sustantivas",null,{"$f":"IF(C10=\"\",\"\",(C10/$C$115)*100)","v":""}]
[null,"c. Agenda de servidores públicos",null,{"$f":"IF(C11=\"\",\"\",(C11/$C$115)*100)","v":""}]
[null,"d. Otros",null,{"$f":"IF(C12=\"\",\"\",(C12/$C$115)*100)","v":""}]
["2. Archivos",null,null,{"$f":"IF(C13=\"\",\"\",(C13/$C$115)*100)","v":""}]
["3. Auditorías",null,{"$f":"SUM(C15:C17)","v":3},{"$f":"IF(C14=0,\"\",(C14/$C$115)*100)","v":9.375}]
[null,"a. Resultados",3,{"$f":"IF(C15=\"\",\"\",(C15/$C$115)*100)","v":9.375}]
[null,"b. Avance de recomendaciones",null,{"$f":"IF(C16=\"\",\"\",(C16/$C$115)*100)","v":""}]
[null,"c. Otros",null,{"$f":"IF(C17=\"\",\"\",(C17/$C$115)*100)","v":""}]
["4. Campañas electorales",null,null,{"$f":"IF(C18=\"\",\"\",(C18/$C$115)*100)","v":""}]
["5. Compras públicas y contratos",null,{"$f":"SUM(C20:C28)","v":13},{"$f":"IF(C19=0,\"\",(C19/$C$115)*100)","v":40.625}]
[null,"a. Obras públicas",null,{"$f":"IF(C20=\"\",\"\",(C20/$C$115)*100)","v":""}]
[null,"b. Bienes adquiridos",5,15.625]
[null,"c. Servicios contratados",5,15.625]
[null,"d. Bienes arrendados",3,9.375]
[null,"e. Licitaciones",null,""]
[null,"f. Adjudicaciones directas",null,""]
[null,"g. Invitación a proveedores",null,""]
[null,"h. Publicidad oficial",null,""]
[null,"i. Otros",null,""]
["6. Comunidades Indígenas",null,null,""]
["7. Comunidades LGTBI",null,null,""]
["8. Datos personales",null,{"$f":"SUM(C32:C35)","v":4},{"$f":"IF(C31=0,\"\",(C31/$C$115)*100)","v":12.5}]
[null,"a. Datos personales",2,{"$f":"IF(C32=\"\",\"\",(C32/$C$115)*100)","v":6.25}]
[null,"b. Expediente clínico o médico",null,""]
[null,"c. Expediente laboral",2,6.25]
[null,"d. Otros",null,""]
["9. Desastres y protección civil",null,null,""]
["10. Discriminación",null,null,""]
["11. Educación",null,null,""]
["12. Estructura Orgánica",null,{"$f":"SUM(C40:C43)","v":2},{"$f":"IF(C39=0,\"\",(C39/$C$115)*100)","v":6.25}]
[null,"a. Organigrama",2,{"$f":"IF(Formato!$C40=\"\",\"\",(Formato!$C40/$C$115)*100)","v":6.25}]
[null,"b. Directorio",null,{"$f":"IF(Formato!$C41=\"\",\"\",(Formato!$C41/$C$115)*100)","v":""}]
[null,"c. Vacantes",null,{"$f":"IF(Formato!$C42=\"\",\"\",(Formato!$C42/$C$115)*100)","v":""}]
[null,"d. Otros",null,{"$f":"IF(Formato!$C43=\"\",\"\",(Formato!$C43/$C$115)*100)","v":""}]
["13. Gastos",null,{"$f":"SUM(C45:C48)","v":5},{"$f":"IF(C44=0,\"\",(C44/$C$115)*100)","v":15.625}]
[null,"a. Gastos operativos",null,{"$f":"IF(Formato!$C45=\"\",\"\",(Formato!$C45/$C$115)*100)","v":""}]
[null,"b. Gastos administrativos",5,{"$f":"IF(Formato!$C46=\"\",\"\",(Formato!$C46/$C$115)*100)","v":15.625}]
[null,"c. Gastos de representación",null,{"$f":"IF(Formato!$C47=\"\",\"\",(Formato!$C47/$C$115)*100)","v":""}]
[null,"d. Otros",null,{"$f":"IF(Formato!$C48=\"\",\"\",(Formato!$C48/$C$115)*100)","v":""}]
["14. Igualdad de género",null,{"$f":"SUM(C50:C55)","v":1},{"$f":"IF(C49=0,\"\",(C49/$C$115)*100)","v":3.125}]
[null,"a. Programas de apoyo a mujeres",1,{"$f":"IF(Formato!$C50=\"\",\"\",(Formato!$C50/$C$115)*100)","v":3.125}]
[null,"b. Salud de la mujer",null,{"$f":"IF(Formato!$C51=\"\",\"\",(Formato!$C51/$C$115)*100)","v":""}]
[null,"c. Violencia de género",null,{"$f":"IF(Formato!$C52=\"\",\"\",(Formato!$C52/$C$115)*100)","v":""}]
[null,"d. Discriminación laboral",null,{"$f":"IF(Formato!$C53=\"\",\"\",(Formato!$C53/$C$115)*100)","v":""}]
[null,"e. Mujeres empresarias",null,{"$f":"IF(Formato!$C54=\"\",\"\",(Formato!$C54/$C$115)*100)","v":""}]
[null,"f. Otros",null,{"$f":"IF(Formato!$C55=\"\",\"\",(Formato!$C55/$C$115)*100)","v":""}]
["15. Información generada o administrada por el sujeto obligado",null,{"$f":"SUM(C57:C63)","v":0},{"$f":"IF(C56=0,\"\",(C56/$C$115)*100)","v":""}]
[null,"a. Trámites",null,{"$f":"IF(Formato!$C57=\"\",\"\",(Formato!$C57/$C$115)*100)","v":""}]
[null,"b. Concesiones",null,{"$f":"IF(Formato!$C58=\"\",\"\",(Formato!$C58/$C$115)*100)","v":""}]
[null,"c. Estadísticas",null,{"$f":"IF(Formato!$C59=\"\",\"\",(Formato!$C59/$C$115)*100)","v":""}]
[null,"d. Resultados de encuestas",null,{"$f":"IF(Formato!$C60=\"\",\"\",(Formato!$C60/$C$115)*100)","v":""}]
[null,"e. Marco jurídico",null,{"$f":"IF(Formato!$C61=\"\",\"\",(Formato!$C61/$C$115)*100)","v":""}]
[null,"f. Presupuesto o avance financiero",null,{"$f":"IF(Formato!$C62=\"\",\"\",(Formato!$C62/$C$115)*100)","v":""}]
[null,"g. Otros",null,{"$f":"IF(Formato!$C63=\"\",\"\",(Formato!$C63/$C$115)*100)","v":""}]
["16. Información sobre servidores públicos",null,{"$f":"SUM(C65:C69)","v":3},{"$f":"IF(C64=0,\"\",(C64/$C$115)*100)","v":9.375}]
[null,"a. Sueldos",3,{"$f":"IF(Formato!$C65=\"\",\"\",(Formato!$C65/$C$115)*100)","v":9.375}]
[null,"b. Prestaciones de servidores públicos",null,{"$f":"IF(Formato!$C66=\"\",\"\",(Formato!$C66/$C$115)*100)","v":""}]
[null,"c. Información curricular",null,{"$f":"IF(Formato!$C67=\"\",\"\",(Formato!$C67/$C$115)*100)","v":""}]
[null,"d. Declaraciones patrimoniales",null,{"$f":"IF(Formato!$C68=\"\",\"\",(Formato!$C68/$C$115)*100)","v":""}]
[null,"e. Otros",null,{"$f":"IF(Formato!$C69=\"\",\"\",(Formato!$C69/$C$115)*100)","v":""}]
["17. Medio ambiente",null,null,{"$f":"IF(Formato!$C70=\"\",\"\",(Formato!$C70/$C$115)*100)","v":""}]
["18. Programas de subsidios",null,{"$f":"SUM(C72:C77)","v":0},{"$f":"IF(C71=0,\"\",(C71/$C$115)*100)","v":""}]
[null,"a. Diseño y planeación",null,{"$f":"IF(Formato!$C72=\"\",\"\",(Formato!$C72/$C$115)*100)","v":""}]
[null,"b. Presupuesto o avance financiero",null,{"$f":"IF(Formato!$C73=\"\",\"\",(Formato!$C73/$C$115)*100)","v":""}]
[null,"c. Criterios de acceso y esquema de operación",null,{"$f":"IF(Formato!$C74=\"\",\"\",(Formato!$C74/$C$115)*100)","v":""}]
[null,"d. Padrón de beneficiarios",null,{"$f":"IF(Formato!$C75=\"\",\"\",(Formato!$C75/$C$115)*100)","v":""}]
[null,"e. Resultados, indicadores de impacto, informes, evaluaciones",null,{"$f":"IF(Formato!$C76=\"\",\"\",(Formato!$C76/$C$115)*100)","v":""}]
[null,"f. Otros",null,{"$f":"IF(Formato!$C77=\"\",\"\",(Formato!$C77/$C$115)*100)","v":""}]
["19. Programas sociales",null,{"$f":"SUM(C79:C84)","v":0},{"$f":"IF(C78=0,\"\",(C78/$C$115)*100)","v":""}]
[null,"a. Diseño y planeación",null,{"$f":"IF(Formato!$C79=\"\",\"\",(Formato!$C79/$C$115)*100)","v":""}]
[null,"b. Presupuesto o avance financiero",null,{"$f":"IF(Formato!$C80=\"\",\"\",(Formato!$C80/$C$115)*100)","v":""}]
[null,"c. Criterios de acceso y esquema de operación",null,{"$f":"IF(Formato!$C81=\"\",\"\",(Formato!$C81/$C$115)*100)","v":""}]
[null,"d. Padrón de beneficiarios",null,{"$f":"IF(Formato!$C82=\"\",\"\",(Formato!$C82/$C$115)*100)","v":""}]
[null,"e. Resultados, indicadores de impacto, informes, evaluaciones",null,{"$f":"IF(Formato!$C83=\"\",\"\",(Formato!$C83/$C$115)*100)","v":""}]
[null,"f. Otros",null,{"$f":"IF(Formato!$C84=\"\",\"\",(Formato!$C84/$C$115)*100)","v":""}]
["20. Salud",null,{"$f":"SUM(C86:C88)","v":0},{"$f":"IF(C85=0,\"\",(C85/$C$115)*100)","v":""}]
[null,"a. Pandemia",null,{"$f":"IF(Formato!$C86=\"\",\"\",(Formato!$C86/$C$115)*100)","v":""}]
[null,"b. Disponibilidad y abasto de medicamentos",null,{"$f":"IF(Formato!$C87=\"\",\"\",(Formato!$C87/$C$115)*100)","v":""}]
[null,"c. Otros",null,{"$f":"IF(Formato!$C88=\"\",\"\",(Formato!$C88/$C$115)*100)","v":""}]
["21. Sanciones",null,{"$f":"SUM(C90:C91)","v":0},{"$f":"IF(C89=0,\"\",(C89/$C$115)*100)","v":""}]
[null,"a. Servidores públicos",null,{"$f":"IF(Formato!$C90=\"\",\"\",(Formato!$C90/$C$115)*100)","v":""}]
[null,"b. Particulares",null,{"$f":"IF(Formato!$C91=\"\",\"\",(Formato!$C91/$C$115)*100)","v":""}]
["22. Seguridad Nacional",null,{"$f":"SUM(C93:C99)","v":0},{"$f":"IF(C92=0,\"\",(C92/$C$115)*100)","v":""}]
[null,"a. Estrateias de seguridad nacional",null,{"$f":"IF(Formato!$C93=\"\",\"\",(Formato!$C93/$C$115)*100)","v":""}]
[null,"b. instalaciones estratégicas",null,{"$f":"IF(Formato!$C94=\"\",\"\",(Formato!$C94/$C$115)*100)","v":""}]
[null,"c. Operación de instituciones",null,{"$f":"IF(Formato!$C95=\"\",\"\",(Formato!$C95/$C$115)*100)","v":""}]
[null,"d. Adquisiciones",null,{"$f":"IF(Formato!$C96=\"\",\"\",(Formato!$C96/$C$115)*100)","v":""}]
[null,"e. Documentos oficiales",null,{"$f":"IF(Formato!$C97=\"\",\"\",(Formato!$C97/$C$115)*100)","v":""}]
[null,"f. Normas",null,{"$f":"IF(Formato!$C98=\"\",\"\",(Formato!$C98/$C$115)*100)","v":""}]
[null,"g. Otros",null,{"$f":"IF(Formato!$C99=\"\",\"\",(Formato!$C99/$C$115)*100)","v":""}]
["23. Sentencias y resoluciones",null,null,{"$f":"IF(Formato!$C100=\"\",\"\",(Formato!$C100/$C$115)*100)","v":""}]
["24. Violaciones a Derechos Humanos",null,{"$f":"SUM(C102:C109)","v":0},{"$f":"IF(C101=0,\"\",(C101/$C$115)*100)","v":""}]
[null,"a. Desaparición forzada",null,{"$f":"IF(Formato!$C102=\"\",\"\",(Formato!$C102/$C$115)*100)","v":""}]
[null,"b. Tortura",null,{"$f":"IF(Formato!$C103=\"\",\"\",(Formato!$C103/$C$115)*100)","v":""}]
[null,"c. Libertad de expresión",null,{"$f":"IF(Formato!$C104=\"\",\"\",(Formato!$C104/$C$115)*100)","v":""}]
[null,"d. Masacres",null,{"$f":"IF(Formato!$C105=\"\",\"\",(Formato!$C105/$C$115)*100)","v":""}]
[null,"e. Casos espécificos de violaciones a derechos humanos",null,{"$f":"IF(Formato!$C106=\"\",\"\",(Formato!$C106/$C$115)*100)","v":""}]
[null,"f. Violencia política",null,{"$f":"IF(Formato!$C107=\"\",\"\",(Formato!$C107/$C$115)*100)","v":""}]
[null,"g. Acceso a la justicia",null,{"$f":"IF(Formato!$C108=\"\",\"\",(Formato!$C108/$C$115)*100)","v":""}]
[null,"h. Otros.",null,{"$f":"IF(Formato!$C109=\"\",\"\",(Formato!$C109/$C$115)*100)","v":""}]
["25. Otros más frecuentes (especificar)",null,"Temática de preguntas frecuentes (Seleccionar)"]
[null,"a) Pregunta más frecuente"]
[null,"b) Segunda pregunta más frecuente"]
[null,"c) Tercera pregunta más frecuente"]
[null,"d) Cuarta pregunta más frecuente"]
["T o t a l (SIN OTROS MÁS FRECUENTES)",null,{"$f":"SUM(C8,C13,C14,C18,C19,C29,C30,C31,C36,C37,C38,C39,C44,C49,C56,C64,C71,C70,C78,C85,C89,C92,C100,C101)","v":32},{"$f":"IF(C115=0,\"\",(C115/$C$115)*100)","v":100}]

{"sheet":"Catálogo","index":1,"n_rows":844,"n_cols":7,"rows_kept":844,"cut":false,"hidden":true,"merged":[]}
["Seleccione el nombre del sujeto obligado","Cve","DGEN","Sector","Seleccionar","Seleccionar"]
["9/11 de la recaudación por concepto de las cuotas establecidas en el artículo 2°A. Fracción II de la Ley del Impuesto Especial sobre Producción y Servicios","06005","DGEAPCTA","Fideicomisos y fondos públicos","4° 2020","Si","Actividades de la institución "]
["Administración de los recursos producto de la venta de publicaciones de la Suprema Corte para el financiamiento de nuevas publicaciones y cualquier proyecto de interés para el fideicomitente","03301","DGEPLJ","Fideicomisos y fondos públicos","1° 2021","No","Auditorias al ejercicio presupuestal"]
["Administración del Patrimonio de la Beneficencia Pública (*)","12001","DGEAPCTA","Ejecutivo","2° 2021",null,"Datos personales"]
["Administración Portuaria Integral de Altamira, S.A. de C.V.","09176","DGOAEEF","Ejecutivo","3° 2021",null,"Estructura orgánica"]
["Administración Portuaria Integral de Coatzacoalcos, S.A. de C.V.","09183","DGOAEEF","Ejecutivo","4° 2021",null,"Gastos"]
["Administración Portuaria Integral de Dos Bocas, S.A. de C.V.","09180","DGOAEEF","Ejecutivo","1° 2022",null,"Igualdad de Género"]
["Administración Portuaria Integral de Ensenada, S.A. de C.V.","09169","DGOAEEF","Ejecutivo","2° 2022",null,"Información generada o administrada por el sujeto obligado"]
["Administración Portuaria Integral de Guaymas, S.A. de C.V.","09177","DGOAEEF","Ejecutivo","3° 2022",null,"Información referente a contratos celebrados"]
["Administración Portuaria Integral de Lázaro Cárdenas, S.A. de C.V.","09178","DGOAEEF","Ejecutivo","4° 2022",null,"Otros Rubros"]
["Administración Portuaria Integral de Manzanillo, S.A. de C.V.","09179","DGOAEEF","Ejecutivo","1° 2023",null,"Otros Rubros Generales"]
["Administración Portuaria Integral de Mazatlán, S.A. de C.V.","09171","DGOAEEF","Ejecutivo","2° 2023",null,"Programas de subsidio"]
["Administración Portuaria Integral de Progreso, S.A. de C.V.","09172","DGOAEEF","Ejecutivo","3° 2023",null,"Remuneraciones"]
["Administración Portuaria Integral de Puerto Madero, S.A. de C.V.","09186","DGOAEEF","Ejecutivo","4° 2023",null,"Seguridad Nacional"]
["Administración Portuaria Integral de Puerto Vallarta, S.A. de C.V.","09173","DGOAEEF","Ejecutivo","1° 2024",null,"Violaciones a Derechos Humanos"]
["Administración Portuaria Integral de Salina Cruz, S.A. de C.V.","09184","DGOAEEF","Ejecutivo","2° 2024"]
["Administración Portuaria Integral de Tampico, S.A. de C.V.","09181","DGOAEEF","Ejecutivo","3° 2024"]
["Administración Portuaria Integral de Topolobampo, S.A. de C.V.","09174","DGOAEEF","Ejecutivo","4° 2024"]
["Administración Portuaria Integral de Tuxpan, S.A. de C.V.","09175","DGOAEEF","Ejecutivo"]
["Administración Portuaria Integral de Veracruz, S.A. de C.V.","09182","DGOAEEF","Ejecutivo"]
["Aeropuerto Internacional de la Ciudad de México, S.A. de C.V.","09451","DGOAEEF","Ejecutivo"]
["Aeropuerto Internacional Felipe Ángeles, S.A. de C.V.",7003,"DGEAPCTA","Ejecutivo"]
["Aeropuertos y Servicios Auxiliares","09085","DGEPPOED","Ejecutivo"]
["Agencia Espacial Mexicana","09087","DGEPPOED","Ejecutivo"]
["Agencia Federal de Aviación Civil","09012","DGEAPCTA","Ejecutivo"]
["Agencia Mexicana de Cooperación Internacional para el Desarrollo (*)","05100","DGEAPCTA","Ejecutivo"]
["Agencia Nacional de Seguridad Industrial y de Protección al Medio Ambiente del Sector Hidrocarburos","16211","DGOAEEF","Ejecutivo"]
["Agencia Reguladora del Transporte Ferroviario (*)","09010","DGEAPCTA","Ejecutivo"]
["Agroasemex, S.A.","06084","DGOAEEF","Ejecutivo"]
["Almacenadora Sur, S.A.","64405","DGEPPOED","Fideicomisos y fondos públicos"]
["Archivo General de la Nación","04950","DGEPPOED","Ejecutivo"]
["Asociación Autónoma del Personal Académico de la Universidad Nacional Autónoma de México","60100","DGEALSUPFM","Sindicatos"]
["Asociación Sindical de Oficiales de Máquinas de la Marina Mercante Nacional","60267","DGEALSUPFM","Sindicatos"]
["Auditoría Superior de la Federación","01100","DGEPLJ","Legislativo"]
["Autoridad Educativa Federal en la Ciudad de México","25101","DGEAPCTA","Ejecutivo"]
["Bachillerato general en sus modalidades no escolarizada y mixta","11007","DGEAPCTA","Fideicomisos y fondos públicos"]
["Banco de México","61100","DGOAEEF","Órganos Autónomos"]
["Banco del Bienestar ","06800","DGOAEEF","Ejecutivo"]
["Banco Nacional de Comercio Exterior, S.N.C.","06305","DGOAEEF","Ejecutivo"]
["Banco Nacional de Obras y Servicios Públicos, S.N.C.","06320","DGOAEEF","Ejecutivo"]
["Banco Nacional del Ejército, Fuerza Aérea y Armada, S.N.C.","06325","DGOAEEF","Ejecutivo"]
["Cámara de Diputados","01200","DGEPLJ","Legislativo"]
["Caminos y Puentes Federales de Ingresos y Servicios Conexos","09120","DGEPPOED","Ejecutivo"]
["Casa de Moneda de México","06363","DGEPPOED","Ejecutivo"]
["Centro de Capacitación Cinematográfica, A.C.","11063","DGOAEEF","Ejecutivo"]
["Centro de Enseñanza Técnica Industrial","11065","DGEPPOED","Ejecutivo"]
["Centro de Estudios para la Preparación y Evaluación Socioeconómica de Proyectos (CEPEP)","06006","DGEAPCTA","Fideicomisos y fondos públicos"]
["Centro de Ingeniería y Desarrollo Industrial","11121","DGEPPOED","Ejecutivo"]
["Centro de Investigación Científica de Yucatán, A.C.","11108","DGOAEEF","Ejecutivo"]
["Centro de Investigación Científica y de Educación Superior de Ensenada, Baja California","11101","DGEPPOED","Ejecutivo"]
["Centro de Investigación en Alimentación y Desarrollo, A.C.","11083","DGOAEEF","Ejecutivo"]
["Centro de Investigación en Ciencias de Información Geoespacial","11080","DGOAEEF","Ejecutivo"]
["Centro de Investigación en Matemáticas, A.C.","11102","DGOAEEF","Ejecutivo"]
["Centro de Investigación en Materiales Avanzados, S.C.","11088","DGOAEEF","Ejecutivo"]
["Centro de Investigación en Química Aplicada","11111","DGEPPOED","Ejecutivo"]
["Centro de Investigación y Asistencia en Tecnología y Diseño del Estado de Jalisco, A.C.","11103","DGOAEEF","Ejecutivo"]
["Centro de Investigación y de Estudios Avanzados del Instituto Politécnico Nacional","11085","DGEPPOED","Ejecutivo"]
["Centro de Investigación y Desarrollo Tecnológico en Electroquímica, S.C.","11106","DGOAEEF","Ejecutivo"]
["Centro de Investigación y Docencia Económicas, A.C.","11090","DGOAEEF","Ejecutivo"]
["Centro de Investigaciones Biológicas del Noroeste, S.C.","11107","DGOAEEF","Ejecutivo"]
["Centro de Investigaciones en Óptica, A.C.","11110","DGOAEEF","Ejecutivo"]
["Centro de Investigaciones y Estudios Superiores en Antropología Social","11100","DGEPPOED","Ejecutivo"]
["Centro de Producción de Programas Informativos y Especiales (*)","04001","DGEAPCTA","Ejecutivo"]
["Centro Federal de Conciliación y Registro Laboral",14112,"DGEALSUPFM","Ejecutivo"]
["Centro Nacional de Control de Energía","11205","DGEPPOED","Ejecutivo"]
["Centro Nacional de Control del Gas Natural","18112","DGEPPOED","Ejecutivo"]
["Centro Nacional de Equidad de Género y Salud Reproductiva (*)","12002","DGEAPCTA","Ejecutivo"]
["Centro Nacional de Excelencia Tecnológica en Salud (*)","12003","DGEAPCTA","Ejecutivo"]
["Centro Nacional de Inteligencia","04100","DGEAPCTA","Ejecutivo"]
["Centro Nacional de la Transfusión Sanguínea (*)","12004","DGEAPCTA","Ejecutivo"]
["Centro Nacional de Metrología","10095","DGEPPOED","Ejecutivo"]
["Centro Nacional de Prevención de Desastres","04130","DGEAPCTA","Ejecutivo"]
["Centro Nacional de Programas Preventivos y Control de Enfermedades (*)","12005","DGEAPCTA","Ejecutivo"]
["Centro Nacional de Trasplantes (*)","12006","DGEAPCTA","Ejecutivo"]
["Centro Nacional para la Prevención y el Control del VIH/SIDA (*)","12008","DGEAPCTA","Ejecutivo"]
["Centro Nacional para la Salud de la Infancia y la Adolescencia (*)","12009","DGEAPCTA","Ejecutivo"]
["Centro Regional de Alta Especialidad de Chiapas","12090","DGEPPOED","Ejecutivo"]
["Centros de Integración Juvenil, A.C.","12100","DGOAEEF","Ejecutivo"]
["CIATEC, A.C. \"Centro de Innovación Aplicada en Tecnologías Competitivas\"","11105","DGOAEEF","Ejecutivo"]
["CIATEQ, A.C. Centro de Tecnología Avanzada","11104","DGOAEEF","Ejecutivo"]
["Colegio de Bachilleres","11115","DGEPPOED","Ejecutivo"]
["Colegio de Postgraduados","08140","DGEPPOED","Ejecutivo"]
["Colegio Nacional de Educación Profesional Técnica","11125","DGEPPOED","Ejecutivo"]
["Colegio Superior Agropecuario del Estado de Guerrero","08609","DGEAPCTA","Ejecutivo"]
["Comisión de Apelación y Arbitraje del Deporte (*)","11001","DGEAPCTA","Ejecutivo"]
["Comisión de Operación y Fomento de Actividades Académicas del Instituto Politécnico Nacional","11135","DGEPPOED","Ejecutivo"]
["Comisión Ejecutiva de Atención a Víctimas","00633","DGEPPOED","Ejecutivo"]
["Comisión Federal de Competencia Económica","10111","DGOAEEF","Órganos Autónomos"]
["Comisión Federal de Electricidad","18164","DGOAEEF","Ejecutivo"]
["Comisión Federal para la Protección contra Riesgos Sanitarios","12151","DGEAPCTA","Ejecutivo"]
["Comisión Nacional Bancaria y de Valores","06100","DGEAPCTA","Ejecutivo"]
["Comisión Nacional contra las Adicciones (*)","12007","DGEAPCTA","Ejecutivo"]
["Comisión Nacional de Acuacultura y Pesca","08197","DGEAPCTA","Ejecutivo"]
["Comisión Nacional de Arbitraje Médico","42207","DGEAPCTA","Ejecutivo"]
["Comisión Nacional de Áreas Naturales Protegidas","16151","DGEAPCTA","Ejecutivo"]
["Comisión Nacional de Bioética (*)","12010","DGEAPCTA","Ejecutivo"]
["Comisión Nacional de Búsqueda de Personas (*)","04016","DGEAPCTA","Ejecutivo"]
["Comisión Nacional de Cultura Física y Deporte","11131","DGEPPOED","Ejecutivo"]
["Comisión Nacional de Hidrocarburos","18001","DGOAEEF","Ejecutivo"]
["Comisión Nacional de las Zonas Áridas","20090","DGEPPOED","Ejecutivo"]
["Comisión Nacional de Libros de Texto Gratuitos","11137","DGEPPOED","Ejecutivo"]
["Comisión Nacional de los Derechos Humanos","35100","DGOAEEF","Órganos Autónomos"]
["Comisión Nacional de los Salarios Mínimos","14075","DGEPPOED","Ejecutivo"]
["Comisión Nacional de Mejora Regulatoria","10141","DGOAEEF","Ejecutivo"]
["Comisión Nacional de Seguridad Nuclear y Salvaguardias","18100","DGOAEEF","Ejecutivo"]
["Comisión Nacional de Seguros y Fianzas","06111","DGEAPCTA","Ejecutivo"]
["Comisión Nacional de Vivienda","20120","DGEPPOED","Ejecutivo"]
["Comisión Nacional del Agua","16101","DGEAPCTA","Ejecutivo"]
["Comisión Nacional del Sistema de Ahorro para el Retiro","06121","DGEAPCTA","Ejecutivo"]
["Comisión Nacional Forestal","16161","DGEPPOED","Ejecutivo"]
["Comisión Nacional para el Uso Eficiente de la Energía","18191","DGOAEEF","Ejecutivo"]
["Comisión Nacional para la Mejora Continua de la Educación","11323","DGEPPOED","Ejecutivo"]
["Comisión Nacional para la Protección y Defensa de los Usuarios de Servicios Financieros","06370","DGEPPOED","Ejecutivo"]
["Comisión Nacional para Prevenir y Erradicar la Violencia Contra las Mujeres (*)","04002","DGEAPCTA","Ejecutivo"]
["Comisión Reguladora de Energía","18111","DGOAEEF","Ejecutivo"]
["Comité de Participación Ciudadana del Sistema Nacional Anticorrupción",47002,"DGEPPOED","Ejecutivo"]
["Comité Nacional para el Desarrollo Sustentable de la Caña de Azúcar (*)","08001","DGEAPCTA","Ejecutivo"]
["Compañía Mexicana de Exploraciones, S.A. de C.V.","18200","DGOAEEF","Ejecutivo"]
["Compañía Operadora del Centro Cultural y Turístico de Tijuana, S.A. de C.V.","11148","DGOAEEF","Ejecutivo"]
["Complemento del Préstamo Especial para el Ahorro (PEA) y préstamos de corto y mediano plazo para jubilados bajo el plan de beneficio definido","06781","DGOAEEF","Fideicomisos y fondos públicos"]
{"$rows_left_out":724}